我的应用无法在 App Center 上构建,并出现以下错误:
/Users/runner/work/1/s/xxx/Lib/Api/ApiClient.swift:137:67: error: missing argument for parameter 'headers' in call
parameters: parameters,
^
, headers: <#[String : String]?#>
__ObjC.AFHTTPSessionManager:12:15: note: 'get(_:parameters:headers:progress:success:failure:)' declared here
open func get(_ URLString: String, parameters: Any?, headers: [String : String]?, progress downloadProgress: ((Progress) -> Void)?, success: ((URLSessionDataTask, Any?) -> Void)?, failure: ((URLSessionDataTask?, Error) -> Void)? = nil) -> URLSessionDataTask?
^
/Users/runner/work/1/s/xxx/Lib/Api/ApiClient.swift:143:68: error: missing argument for parameter 'headers' in call
parameters: parameters,
^
, headers: <#[String : String]?#>
__ObjC.AFHTTPSessionManager:18:15: note: 'post(_:parameters:headers:progress:success:failure:)' declared here
open func post(_ URLString: String, parameters: Any?, headers: [String : String]?, progress uploadProgress: ((Progress) -> Void)?, success: ((URLSessionDataTask, Any?) -> Void)?, failure: ((URLSessionDataTask?, Error) -> Void)? = nil) -> URLSessionDataTask?
^
/Users/runner/work/1/s/xxx/Lib/Api/ApiClient.swift:149:69: error: missing argument for parameter 'headers' in call
parameters: parameters,
^
, headers: <#[String : String]?#>
__ObjC.AFHTTPSessionManager:27:15: note: 'patch(_:parameters:headers:success:failure:)' declared here
open func patch(_ URLString: String, parameters: Any?, headers: [String : String]?, success: ((URLSessionDataTask, Any?) -> Void)?, failure: ((URLSessionDataTask?, Error) -> Void)? = nil) -> URLSessionDataTask?
^
/Users/runner/work/1/s/xxx/Lib/Api/ApiClient.swift:154:70: error: missing argument for parameter 'headers' in call
parameters: parameters,
^
, headers: <#[String : String]?#>
__ObjC.AFHTTPSessionManager:30:15: note: 'delete(_:parameters:headers:success:failure:)' declared here
open func delete(_ URLString: String, parameters: Any?, headers: [String : String]?, success: ((URLSessionDataTask, Any?) -> Void)?, failure: ((URLSessionDataTask?, Error) -> Void)? = nil) -> URLSessionDataTask?
^
^
和
** ARCHIVE FAILED **
The following build commands failed:
CompileSwift normal arm64
CompileSwiftSources normal arm64 com.apple.xcode.tools.swift.compiler
(2 failures)
##[error]Error: /usr/bin/xcodebuild failed with return code: 65
##[section]Finishing: Xcode build (signed)
##[section]Starting: Xcode build (signed)
有问题的代码:
switch method {
case "GET":
requestOperation = self.get(URL,
parameters: parameters,
progress: nil,
success: baseSuccessBlock,
failure: baseFailureBlock)
case "POST":
requestOperation = self.post(URL,
parameters: parameters,
progress: nil,
success: baseSuccessBlock,
failure: baseFailureBlock)
case "PATCH":
requestOperation = self.patch(URL,
parameters: parameters,
success: baseSuccessBlock,
failure: baseFailureBlock)
case "DELETE":
requestOperation = self.delete(URL,
parameters: parameters,
success: baseSuccessBlock,
failure: baseFailureBlock)
default:
requestOperation = nil
}
该应用程序在我的 Xcode 本地计算机上成功构建。我在本地的构建设置是:
- iOS 部署目标:11.0
- 斯威夫特语言版本:5
其他信息:
- Xcode 版本:11.6
- AFNetworking Pod 版本:3.2.1
- MacOS 版本:Catalina 10.15.6
- Cocoapods 版本:1.7.5
App Center 上构建设置下的 Xcode 版本也设置为 11.6。
这似乎是 AFNetworking pod 的问题,但是在添加headers
参数时我在 Xcode 中遇到错误:Extra argument 'headers' in call