我有 Qt 5.2.1(用 gcc 4.8.2 编译)和 gcc 4.9.4(mingw-w64)编译器。
C++11 工作正常。总是有,即使是 4.8.2 编译器。
我需要一些 C++14 特性。我想使用最新的编译器,但对 ABI 更改的关注让我得到了 4.9.2。gcc 4.9.2 应该支持 make_unique 和 C++14。
我遇到的问题是我似乎无法在 Qt Creator 中获得 C++14 支持。
尝试添加到专业文件...没有用。
CONFIG += c++14
尝试添加到专业文件...不起作用:
QMAKE_CXXFLAGS_CXX14 = -std=c++14
尝试添加到专业文件...不起作用:
QMAKE_CXXFLAGS_CXX14 = -std=c++14
QMAKE_CXXFLAGS_GNUCXX14 = -std=c++14
尝试添加到专业文件...不起作用:
win32-g++ {
QMAKE_CXXFLAGS_CXX14 = -std=c++14
QMAKE_CXXFLAGS_GNUCXX14 = -std=c++14
}
尝试向此添加/编辑 win32-g++ makespec 文件...不起作用
QMAKE_CXXFLAGS_CXX11 = -std=c++0x
QMAKE_CXXFLAGS_CXX14 = -std=c++14
QMAKE_CXXFLAGS_GNUCXX14 = -std=c++14
尝试向此添加/编辑 win32-g++ makespec 文件...不起作用
QMAKE_CXXFLAGS_CXX14 = -std=c++14
QMAKE_CXXFLAGS_GNUCXX14 = -std=c++14
尝试向此添加/编辑 win32-g++ makespec 文件...不起作用
QMAKE_CXXFLAGS_CXX11 = -std=c++14
QMAKE_CXXFLAGS_CXX14 = -std=c++14
QMAKE_CXXFLAGS_GNUCXX14 = -std=c++14
尝试向此添加/编辑 win32-g++ makespec 文件...不起作用
QMAKE_CXXFLAGS_CXX11 = -std=c++14
我相信 QMake 是问题所在。当然,我不确定。
编辑——添加更多输入
轮廓
#-------------------------------------------------
#
# Project created by QtCreator 2018-02-05T13:02:30
#
#-------------------------------------------------
QMAKE_CXXFLAGS += -std=c++1y
QT += core
QT -= gui
TARGET = test2
CONFIG += console
CONFIG -= app_bundle
TEMPLATE = app
SOURCES += main.cpp
测试代码
#include <QCoreApplication>
#include <iostream>
#include <memory>
using namespace std;
class A{
public:
A(){cout << "ctorA " << endl;}
~A(){cout << "dtorA " << endl;}
};
class X{
A arr[10];
};
int main(int argc, char *argv[])
{
QCoreApplication a(argc, argv);
{ unique_ptr<X> upX = make_unique<X>(); }
return a.exec();
}
编译器输出
14:01:39: Running steps for project test2...
14:01:39: Configuration unchanged, skipping qmake step.
14:01:39: Starting: "C:\DTOOLS\QtLib5.2.1-QtCreator3.0.1__T-Win-64b_B-gcc4.8.2-seh-posix-opengl\QtSDK-x86_64\bin\mingw32-make.exe"
C:/DTOOLS/QtLib5.2.1-QtCreator3.0.1__T-Win-64b_B-gcc4.8.2-seh-posix-opengl/QtSDK-x86_64/bin/mingw32-make -f Makefile.Release
mingw32-make[1]: Entering directory 'C:/DEV/test2'
g++ -c -march=nocona -mtune=core2 -pipe -fno-keep-inline-dllexport -std=c++1y -O2 -frtti -Wall -Wextra -fexceptions -mthreads -DUNICODE -DQT_NO_DEBUG -DQT_CORE_LIB -I. -I"..\..\DTOOLS\QtLib5.2.1-QtCreator3.0.1__T-Win-64b_B-gcc4.8.2-seh-posix-opengl\QtSDK-x86_64\include" -I"..\..\DTOOLS\QtLib5.2.1-QtCreator3.0.1__T-Win-64b_B-gcc4.8.2-seh-posix-opengl\QtSDK-x86_64\include\QtCore" -I"release" -I"..\..\DTOOLS\QtLib5.2.1-QtCreator3.0.1__T-Win-64b_B-gcc4.8.2-seh-posix-opengl\QtSDK-x86_64\mkspecs\win32-g++" -o release\main.o main.cpp
main.cpp: In function 'int main(int, char**)':
main.cpp:21:27: error: 'make_unique' was not declared in this scope
{ unique_ptr<X> upX = make_unique<X>(); }
^
main.cpp:21:40: error: expected primary-expression before '>' token
{ unique_ptr<X> upX = make_unique<X>(); }
^
main.cpp:21:42: error: expected primary-expression before ')' token
{ unique_ptr<X> upX = make_unique<X>(); }
^
Makefile.Release:177: recipe for target 'release/main.o' failed
mingw32-make[1]: *** [release/main.o] Error 1
mingw32-make[1]: Leaving directory 'C:/DEV/test2'
Makefile:34: recipe for target 'release' failed
mingw32-make: *** [release] Error 2
14:01:40: The process "C:\DTOOLS\QtLib5.2.1-QtCreator3.0.1__T-Win-64b_B-gcc4.8.2-seh-posix-opengl\QtSDK-x86_64\bin\mingw32-make.exe" exited with code 2.
Error while building/deploying project test2 (kit: QtLib5.2.1_t-Win-64b_B-gcc9.9.4)
When executing step 'Make'
14:01:40: Elapsed time: 00:01.