我是使用 iPhone 构建 pjsip 的新手。我正在使用 iOS 9.3.2、Xcode 7.3 和 Pjsip 2.5。我已经成功构建了没有 g729 的 Pjsip 2.5,并且没有 g729 也可以正常工作。由于我的应用程序也需要 g729,因此我遵循此处的所有说明
使用上述步骤启用 g729 后,在 "make dep && make clean && make" 时,它会为我用于我的应用程序的所有架构提供以下错误。
../src/pjsua2-test/main.cpp
if test ! -d ../bin; then mkdir -p ../bin; fi
/Applications/XCode.app/Contents/Developer/Platforms/iPhoneOS.platform/Developer/../../../Toolchains/XcodeDefault.xctoolchain/usr/bin/clang -o ../bin/pjsua2-test-armv7-apple-darwin_ios \
output/pjsua2-test-armv7-apple-darwin_ios/main.o -L/MyApps/pjproject/pjlib/lib -L/MyApps/pjproject/pjlib-util/lib -L/MyApps/pjproject/pjnath/lib -L/MyApps/pjproject/pjmedia/lib -L/MyApps/pjproject/pjsip/lib -L/MyApps/pjproject/third_party/lib -O2 -arch armv7 -isysroot /Applications/XCode.app/Contents/Developer/Platforms/iPhoneOS.platform/Developer/SDKs/iPhoneOS9.3.sdk -framework AudioToolbox -framework Foundation -lpjsua2-armv7-apple-darwin_ios -lstdc++ -lpjsua-armv7-apple-darwin_ios -lpjsip-ua-armv7-apple-darwin_ios -lpjsip-simple-armv7-apple-darwin_ios -lpjsip-armv7-apple-darwin_ios -lpjmedia-codec-armv7-apple-darwin_ios -lpjmedia-armv7-apple-darwin_ios -lpjmedia-videodev-armv7-apple-darwin_ios -lpjmedia-audiodev-armv7-apple-darwin_ios -lpjmedia-armv7-apple-darwin_ios -lpjnath-armv7-apple-darwin_ios -lpjlib-util-armv7-apple-darwin_ios -lsrtp-armv7-apple-darwin_ios -lresample-armv7-apple-darwin_ios -lgsmcodec-armv7-apple-darwin_ios -lspeex-armv7-apple-darwin_ios -lilbccodec-armv7-apple-darwin_ios -lg7221codec-armv7-apple-darwin_ios -lpj-armv7-apple-darwin_ios -lm -lpthread -framework CoreAudio -framework CoreFoundation -framework AudioToolbox -framework CFNetwork -framework UIKit -framework UIKit -framework OpenGLES -framework AVFoundation -framework CoreGraphics -framework QuartzCore -framework CoreVideo -framework CoreMedia
Undefined symbols for architecture armv7:
"_pjmedia_codec_g729_init", referenced from:
_pjmedia_codec_register_audio_codecs in libpjmedia-codec-armv7-apple-darwin_ios.a(audio_codecs.o)
ld: symbol(s) not found for architecture armv7
clang: error: linker command failed with exit code 1 (use -v to see invocation)
make[2]: *** [../bin/pjsua2-test-armv7-apple-darwin_ios] Error 1
make[1]: *** [pjsua2-test-armv7-apple-darwin_ios] Error 2
make: *** [all] Error 1
我真的被困在这里了。请帮我解决这个问题。任何人的一条线索都会有所帮助。